Reaction Details
TargetC-X-C chemokine receptor type 3
LigandBDBM50349678
Substrate/Competitorn/a
Meas. Tech.ChEMBL_760046 (CHEMBL1810322)
IC50 19±n/a nM
Citation Thoma, GBaenteli, RLewis, IJones, DKovarik, JStreiff, MBZerwes, HG Special ergolines efficiently inhibit the chemokine receptor CXCR3 in blood. Bioorg Med Chem Lett21:4745-9 (2011) 
 
C-X-C chemokine receptor type 3
Name:C-X-C chemokine receptor type 3
Type:PROTEIN
Mol. Mass.:40937.37
Organism:Rattus norvegicus
Description:ChEMBL_760041
Residue:367
BDBM50349678
NameBDBM50349678
Synonyms:CHEMBL1806523
TypeSmall organic molecule
Emp. Form.C26H26N4O2
Mol. Mass.426.5102
SMILESO=C(Nc1ccccc1)N1C[C@@H](C=C2[C@H]1Cc1c[nH]c3cccc2c13)C(=O)N1CCCC1