Reaction Details
TargetSmoothened homolog
LigandBDBM50352268
Substrate/Competitorn/a
Meas. Tech.ChEMBL_766580 (CHEMBL1827061)
IC50 5±n/a nM
Citation Muraglia, EOntoria, JMBranca, DDessole, GBresciani, AFonsi, MGiuliano, CLlauger Bufi, LMonteagudo, EPalumbi, MCTorrisi, CRowley, MSteinkühler, CJones, P N-(2-alkylaminoethyl)-4-(1,2,4-oxadiazol-5-yl)piperazine-1-carboxamides as highly potent smoothened antagonists. Bioorg Med Chem Lett21:5283-8 (2011) 
 
Smoothened homolog
Name:Smoothened homolog
Type:Protein
Mol. Mass.:86415.51
Organism:Homo sapiens (Human)
Description:Q99835
Residue:787
BDBM50352268
NameBDBM50352268
Synonyms:CHEMBL1822467
TypeSmall organic molecule
Emp. Form.C26H36N8O2
Mol. Mass.492.6164
SMILESCn1c(nc2ccccc12)-c1noc(n1)N1CCN(CC1)C(=O)NCC1(CCCC1)N1CCCCC1