Reaction Details
Target5-hydroxytryptamine receptor 2C
LigandBDBM50352717
Substrate/Competitorn/a
Meas. Tech.ChEMBL_766794 (CHEMBL1827734)
IC50 227±n/a nM
Citation Seo, HJPark, EJKim, MJKang, SYLee, SHKim, HJLee, KNJung, MELee, MKim, MSSon, EJPark, WKKim, JLee, J Design and synthesis of novel arylpiperazine derivatives containing the imidazole core targeting 5-HT(2A) receptor and 5-HT transporter. J Med Chem54:6305-18 (2011) 
 
5-hydroxytryptamine receptor 2C
Name:5-hydroxytryptamine receptor 2C
Type:G Protein-Coupled Receptor (GPCR)
Mol. Mass.:51836.79
Organism:Homo sapiens (Human)
Description:P28335
Residue:458
BDBM50352717
NameBDBM50352717
Synonyms:CHEMBL1823213 | US8835436, Example 151
TypeSmall organic molecule
Emp. Form.C27H35N5O2
Mol. Mass.461.5991
SMILESCc1nc(C(=O)NC[C@@H](O)CN2CCN(CC2)c2cccc(C)c2C)c(C)n1-c1ccccc1