Reaction Details
TargetNeuropeptide Y receptor type 5
LigandBDBM50353149
Substrate/Competitorn/a
Meas. Tech.ChEMBL_768586 (CHEMBL1832605)
Ki 3.5±n/a nM
Citation Wu, LLu, KDesai, MPackiarajan, MJoshi, AMarzabadi, MRJubian, VAndersen, KChandrasena, GBoyle, NJWalker, MW N-Heteroaryl glycinamides and glycinamines as potent NPY5 antagonists. Bioorg Med Chem Lett21:5573-6 (2011) 
 
Neuropeptide Y receptor type 5
Name:Neuropeptide Y receptor type 5
Type:Enzyme
Mol. Mass.:50746.64
Organism:Homo sapiens (Human)
Description:Q15761
Residue:445
BDBM50353149
NameBDBM50353149
Synonyms:CHEMBL1829321
TypeSmall organic molecule
Emp. Form.C20H30ClN3O4S
Mol. Mass.443.988
SMILESCC(C)S(=O)(=O)NC[C@H]1CC[C@@H](CC1)NC(=O)CN1CCOc2cc(Cl)ccc12