Reaction Details
TargetcAMP-specific 3',5'-cyclic phosphodiesterase 4D
LigandBDBM50353700
Substrate/Competitorn/a
Meas. Tech.ChEMBL_769285 (CHEMBL1833212)
IC50 0.4±n/a nM
Citation Taltavull, JSerrat, JGràcia, JGavaldà, ACórdoba, MCalama, EMontero, JLAndrés, MMiralpeix, MVilella, DHernández, BBeleta, JRyder, HPagès, L Synthesis and biological activity of pyrido[3',2':4,5]furo[3,2-d]pyrimidine derivatives as novel and potent phosphodiesterase type 4 inhibitors. Eur J Med Chem46:4946-56 (2011) 
 
cAMP-specific 3',5'-cyclic phosphodiesterase 4D
Name:cAMP-specific 3',5'-cyclic phosphodiesterase 4D
Type:Protein
Mol. Mass.:91092.69
Organism:Homo sapiens (Human)
Description:Q08499
Residue:809
BDBM50353700
NameBDBM50353700
Synonyms:CHEMBL1830643
TypeSmall organic molecule
Emp. Form.C24H34N6O2
Mol. Mass.438.5658
SMILESCC(C)Nc1nc2oc3c(NCCN4CCOCC4)ncnc3c2c2CC(C)(C)CCc12