Reaction Details
TargetRibosyldihydronicotinamide dehydrogenase [quinone]
LigandBDBM50317133
Substrate/Competitorn/a
Meas. Tech.ChEMBL_771623 (CHEMBL1837963)
IC50 115±n/a nM
Citation Dunstan, MSBarnes, JHumphries, MWhitehead, RCBryce, RALeys, DStratford, IJNolan, KA Novel inhibitors of NRH:quinone oxidoreductase 2 (NQO2): crystal structures, biochemical activity, and intracellular effects of imidazoacridin-6-ones. J Med Chem54:6597-611 (2011) 
 
Ribosyldihydronicotinamide dehydrogenase [quinone]
Name:Ribosyldihydronicotinamide dehydrogenase [quinone]
Type:Protein
Mol. Mass.:25917.25
Organism:Homo sapiens (Human)
Description:P16083
Residue:231
BDBM50317133
NameBDBM50317133
Synonyms:5-(2-(dimethylamino)ethylamino)-6H-imidazo[4,5,1-de]acridin-6-one NSC-645833
TypeSmall organic molecule
Emp. Form.C18H18N4O
Mol. Mass.306.3617
SMILESCN(C)CCNc1ccc2ncn3c2c1c(=O)c1ccccc31