Reaction Details
TargetGlycogen synthase kinase-3 beta
LigandBDBM50354747
Substrate/Competitorn/a
Meas. Tech.ChEMBL_771509 (CHEMBL1837408)
IC50 900±n/a nM
Citation Cociorva, OMLi, BNomanbhoy, TLi, QNakamura, ANakamura, KNomura, MOkada, KSeto, SYumoto, KLiyanage, MZhang, MCAban, ALeen, BSzardenings, AKRosenblum, JSKozarich, JWKohno, YShreder, KR Synthesis and structure-activity relationship of 4-quinolone-3-carboxylic acid based inhibitors of glycogen synthase kinase-3ß. Bioorg Med Chem Lett21:5948-51 (2011) 
 
Glycogen synthase kinase-3 beta
Name:Glycogen synthase kinase-3 beta
Type:Enzyme
Mol. Mass.:46756.38
Organism:Homo sapiens (Human)
Description:P49841
Residue:420
BDBM50354747
NameBDBM50354747
Synonyms:CHEMBL1834331
TypeSmall organic molecule
Emp. Form.C21H20F2N4O3
Mol. Mass.414.4053
SMILESNc1ccc(CCNc2c(F)c(N)c3c(c2F)n(cc(C(O)=O)c3=O)C2CC2)cc1