Reaction Details
TargetGlycogen synthase kinase-3 beta
LigandBDBM50354756
Substrate/Competitorn/a
Meas. Tech.ChEMBL_771509 (CHEMBL1837408)
IC50 45±n/a nM
Citation Cociorva, OMLi, BNomanbhoy, TLi, QNakamura, ANakamura, KNomura, MOkada, KSeto, SYumoto, KLiyanage, MZhang, MCAban, ALeen, BSzardenings, AKRosenblum, JSKozarich, JWKohno, YShreder, KR Synthesis and structure-activity relationship of 4-quinolone-3-carboxylic acid based inhibitors of glycogen synthase kinase-3ß. Bioorg Med Chem Lett21:5948-51 (2011) 
 
Glycogen synthase kinase-3 beta
Name:Glycogen synthase kinase-3 beta
Type:Enzyme
Mol. Mass.:46756.38
Organism:Homo sapiens (Human)
Description:P49841
Residue:420
BDBM50354756
NameBDBM50354756
Synonyms:CHEMBL1834117
TypeSmall organic molecule
Emp. Form.C19H19F2N5O3
Mol. Mass.403.3827
SMILESNc1c(F)c(NCCCn2ccnc2)c(F)c2n(cc(C(O)=O)c(=O)c12)C1CC1