Reaction Details
TargetGlycogen synthase kinase-3 beta
LigandBDBM50354758
Substrate/Competitorn/a
Meas. Tech.ChEMBL_771509 (CHEMBL1837408)
IC50 100±n/a nM
Citation Cociorva, OMLi, BNomanbhoy, TLi, QNakamura, ANakamura, KNomura, MOkada, KSeto, SYumoto, KLiyanage, MZhang, MCAban, ALeen, BSzardenings, AKRosenblum, JSKozarich, JWKohno, YShreder, KR Synthesis and structure-activity relationship of 4-quinolone-3-carboxylic acid based inhibitors of glycogen synthase kinase-3ß. Bioorg Med Chem Lett21:5948-51 (2011) 
 
Glycogen synthase kinase-3 beta
Name:Glycogen synthase kinase-3 beta
Type:Enzyme
Mol. Mass.:46756.38
Organism:Homo sapiens (Human)
Description:P49841
Residue:420
BDBM50354758
NameBDBM50354758
Synonyms:CHEMBL1834119
TypeSmall organic molecule
Emp. Form.C20H18F2N4O3
Mol. Mass.400.3787
SMILESNc1c(F)c(NCCc2ccncc2)c(F)c2n(cc(C(O)=O)c(=O)c12)C1CC1