Reaction Details
TargetGlycogen synthase kinase-3 beta
LigandBDBM50354765
Substrate/Competitorn/a
Meas. Tech.ChEMBL_771509 (CHEMBL1837408)
IC50 13±n/a nM
Citation Cociorva, OMLi, BNomanbhoy, TLi, QNakamura, ANakamura, KNomura, MOkada, KSeto, SYumoto, KLiyanage, MZhang, MCAban, ALeen, BSzardenings, AKRosenblum, JSKozarich, JWKohno, YShreder, KR Synthesis and structure-activity relationship of 4-quinolone-3-carboxylic acid based inhibitors of glycogen synthase kinase-3ß. Bioorg Med Chem Lett21:5948-51 (2011) 
 
Glycogen synthase kinase-3 beta
Name:Glycogen synthase kinase-3 beta
Type:Enzyme
Mol. Mass.:46756.38
Organism:Homo sapiens (Human)
Description:P49841
Residue:420
BDBM50354765
NameBDBM50354765
Synonyms:CHEMBL1834315
TypeSmall organic molecule
Emp. Form.C20H20FN5O3
Mol. Mass.397.4029
SMILESNc1c(F)c(NCCNc2ccccn2)cc2n(cc(C(O)=O)c(=O)c12)C1CC1