Reaction Details
TargetGlycogen synthase kinase-3 beta
LigandBDBM50354766
Substrate/Competitorn/a
Meas. Tech.ChEMBL_771509 (CHEMBL1837408)
IC50 1500±n/a nM
Citation Cociorva, OMLi, BNomanbhoy, TLi, QNakamura, ANakamura, KNomura, MOkada, KSeto, SYumoto, KLiyanage, MZhang, MCAban, ALeen, BSzardenings, AKRosenblum, JSKozarich, JWKohno, YShreder, KR Synthesis and structure-activity relationship of 4-quinolone-3-carboxylic acid based inhibitors of glycogen synthase kinase-3ß. Bioorg Med Chem Lett21:5948-51 (2011) 
 
Glycogen synthase kinase-3 beta
Name:Glycogen synthase kinase-3 beta
Type:Enzyme
Mol. Mass.:46756.38
Organism:Homo sapiens (Human)
Description:P49841
Residue:420
BDBM50354766
NameBDBM50354766
Synonyms:CHEMBL1834317
TypeSmall organic molecule
Emp. Form.C23H26FN5O4
Mol. Mass.455.482
SMILESCOc1c(NCCNc2ccccn2)c(F)c(N)c2c1n(cc(C(O)=O)c2=O)C1CCCC1