Reaction Details
TargetGlycogen synthase kinase-3 beta
LigandBDBM50354768
Substrate/Competitorn/a
Meas. Tech.ChEMBL_771509 (CHEMBL1837408)
IC50 1000±n/a nM
Citation Cociorva, OMLi, BNomanbhoy, TLi, QNakamura, ANakamura, KNomura, MOkada, KSeto, SYumoto, KLiyanage, MZhang, MCAban, ALeen, BSzardenings, AKRosenblum, JSKozarich, JWKohno, YShreder, KR Synthesis and structure-activity relationship of 4-quinolone-3-carboxylic acid based inhibitors of glycogen synthase kinase-3ß. Bioorg Med Chem Lett21:5948-51 (2011) 
 
Glycogen synthase kinase-3 beta
Name:Glycogen synthase kinase-3 beta
Type:Enzyme
Mol. Mass.:46756.38
Organism:Homo sapiens (Human)
Description:P49841
Residue:420
BDBM50354768
NameBDBM50354768
Synonyms:CHEMBL1834319
TypeSmall organic molecule
Emp. Form.C18H18FN5O4
Mol. Mass.387.365
SMILESCOc1c(NCCNc2ccccn2)c(F)c(N)c2c(O)c(cnc12)C(O)=O