Reaction Details
TargetGlycogen synthase kinase-3 beta
LigandBDBM50354769
Substrate/Competitorn/a
Meas. Tech.ChEMBL_771509 (CHEMBL1837408)
IC50 270±n/a nM
Citation Cociorva, OMLi, BNomanbhoy, TLi, QNakamura, ANakamura, KNomura, MOkada, KSeto, SYumoto, KLiyanage, MZhang, MCAban, ALeen, BSzardenings, AKRosenblum, JSKozarich, JWKohno, YShreder, KR Synthesis and structure-activity relationship of 4-quinolone-3-carboxylic acid based inhibitors of glycogen synthase kinase-3ß. Bioorg Med Chem Lett21:5948-51 (2011) 
 
Glycogen synthase kinase-3 beta
Name:Glycogen synthase kinase-3 beta
Type:Enzyme
Mol. Mass.:46756.38
Organism:Homo sapiens (Human)
Description:P49841
Residue:420
BDBM50354769
NameBDBM50354769
Synonyms:CHEMBL1834320
TypeSmall organic molecule
Emp. Form.C19H20FN5O4
Mol. Mass.401.3916
SMILESCOc1c(NCCNc2ccccn2)c(F)c(N)c2c1n(C)cc(C(O)=O)c2=O