Reaction Details
TargetGlycogen synthase kinase-3 beta
LigandBDBM50354772
Substrate/Competitorn/a
Meas. Tech.ChEMBL_771509 (CHEMBL1837408)
IC50 44±n/a nM
Citation Cociorva, OMLi, BNomanbhoy, TLi, QNakamura, ANakamura, KNomura, MOkada, KSeto, SYumoto, KLiyanage, MZhang, MCAban, ALeen, BSzardenings, AKRosenblum, JSKozarich, JWKohno, YShreder, KR Synthesis and structure-activity relationship of 4-quinolone-3-carboxylic acid based inhibitors of glycogen synthase kinase-3ß. Bioorg Med Chem Lett21:5948-51 (2011) 
 
Glycogen synthase kinase-3 beta
Name:Glycogen synthase kinase-3 beta
Type:Enzyme
Mol. Mass.:46756.38
Organism:Homo sapiens (Human)
Description:P49841
Residue:420
BDBM50354772
NameBDBM50354772
Synonyms:CHEMBL1834323
TypeSmall organic molecule
Emp. Form.C20H20FN5O4
Mol. Mass.413.4023
SMILESC[C@H]1COc2c(NCCNc3ccccn3)c(F)c(N)c3c2n1cc(C(O)=O)c3=O