Reaction Details
TargetGlycogen synthase kinase-3 beta
LigandBDBM50354775
Substrate/Competitorn/a
Meas. Tech.ChEMBL_771509 (CHEMBL1837408)
IC50 49±n/a nM
Citation Cociorva, OMLi, BNomanbhoy, TLi, QNakamura, ANakamura, KNomura, MOkada, KSeto, SYumoto, KLiyanage, MZhang, MCAban, ALeen, BSzardenings, AKRosenblum, JSKozarich, JWKohno, YShreder, KR Synthesis and structure-activity relationship of 4-quinolone-3-carboxylic acid based inhibitors of glycogen synthase kinase-3ß. Bioorg Med Chem Lett21:5948-51 (2011) 
 
Glycogen synthase kinase-3 beta
Name:Glycogen synthase kinase-3 beta
Type:Enzyme
Mol. Mass.:46756.38
Organism:Homo sapiens (Human)
Description:P49841
Residue:420
BDBM50354775
NameBDBM50354775
Synonyms:CHEMBL1834326
TypeSmall organic molecule
Emp. Form.C21H22FN5O4
Mol. Mass.427.4289
SMILESCC1(C)COc2c(NCCNc3ccccn3)c(F)c(N)c3c2n1cc(C(O)=O)c3=O