Reaction Details
TargetGlycogen synthase kinase-3 beta
LigandBDBM50354776
Substrate/Competitorn/a
Meas. Tech.ChEMBL_771509 (CHEMBL1837408)
IC50 440±n/a nM
Citation Cociorva, OMLi, BNomanbhoy, TLi, QNakamura, ANakamura, KNomura, MOkada, KSeto, SYumoto, KLiyanage, MZhang, MCAban, ALeen, BSzardenings, AKRosenblum, JSKozarich, JWKohno, YShreder, KR Synthesis and structure-activity relationship of 4-quinolone-3-carboxylic acid based inhibitors of glycogen synthase kinase-3ß. Bioorg Med Chem Lett21:5948-51 (2011) 
 
Glycogen synthase kinase-3 beta
Name:Glycogen synthase kinase-3 beta
Type:Enzyme
Mol. Mass.:46756.38
Organism:Homo sapiens (Human)
Description:P49841
Residue:420
BDBM50354776
NameBDBM50354776
Synonyms:CHEMBL1834327
TypeSmall organic molecule
Emp. Form.C21H22FN5O4
Mol. Mass.427.4289
SMILESCC1(C)Cn2cc(C(O)=O)c(=O)c3c(N)c(F)c(NCCNc4ccccn4)c(O1)c23