Reaction Details
TargetGlycogen synthase kinase-3 beta
LigandBDBM50354779
Substrate/Competitorn/a
Meas. Tech.ChEMBL_771509 (CHEMBL1837408)
IC50 12±n/a nM
Citation Cociorva, OMLi, BNomanbhoy, TLi, QNakamura, ANakamura, KNomura, MOkada, KSeto, SYumoto, KLiyanage, MZhang, MCAban, ALeen, BSzardenings, AKRosenblum, JSKozarich, JWKohno, YShreder, KR Synthesis and structure-activity relationship of 4-quinolone-3-carboxylic acid based inhibitors of glycogen synthase kinase-3ß. Bioorg Med Chem Lett21:5948-51 (2011) 
 
Glycogen synthase kinase-3 beta
Name:Glycogen synthase kinase-3 beta
Type:Enzyme
Mol. Mass.:46756.38
Organism:Homo sapiens (Human)
Description:P49841
Residue:420
BDBM50354779
NameBDBM50354779
Synonyms:CHEMBL1834330
TypeSmall organic molecule
Emp. Form.C23H24FN5O4
Mol. Mass.453.4662
SMILESNc1c(F)c(NCCNc2ccccn2)c2OCC3(CCCC3)n3cc(C(O)=O)c(=O)c1c23