Reaction Details
TargetAcetyl-CoA carboxylase 2
LigandBDBM50355924
Substrate/Competitorn/a
Meas. Tech.ChEMBL_775975 (CHEMBL1912973)
IC50 880±n/a nM
Citation Yamashita, TKamata, MEndo, SYamamoto, MKakegawa, KWatanabe, HMiwa, KYamano, TFunata, MSakamoto, JTani, AMol, CDZou, HDougan, DRSang, BSnell, GFukatsu, K Design, synthesis, and structure-activity relationships of spirolactones bearing 2-ureidobenzothiophene as acetyl-CoA carboxylases inhibitors. Bioorg Med Chem Lett21:6314-8 (2011) 
 
Acetyl-CoA carboxylase 2
Name:Acetyl-CoA carboxylase 2
Type:Protein
Mol. Mass.:276535.21
Organism:Homo sapiens (Human)
Description:O00763
Residue:2458
BDBM50355924
NameBDBM50355924
Synonyms:CHEMBL1910394
TypeSmall organic molecule
Emp. Form.C24H30N2O3S
Mol. Mass.426.572
SMILESCC1(C)CC2(CCCN(C2)C2CCN(CC2)C(=O)c2csc3ccccc23)C(=O)O1