Reaction Details
TargetAcetyl-CoA carboxylase 2
LigandBDBM50355931
Substrate/Competitorn/a
Meas. Tech.ChEMBL_775975 (CHEMBL1912973)
IC50 45±n/a nM
Citation Yamashita, TKamata, MEndo, SYamamoto, MKakegawa, KWatanabe, HMiwa, KYamano, TFunata, MSakamoto, JTani, AMol, CDZou, HDougan, DRSang, BSnell, GFukatsu, K Design, synthesis, and structure-activity relationships of spirolactones bearing 2-ureidobenzothiophene as acetyl-CoA carboxylases inhibitors. Bioorg Med Chem Lett21:6314-8 (2011) 
 
Acetyl-CoA carboxylase 2
Name:Acetyl-CoA carboxylase 2
Type:Protein
Mol. Mass.:276535.21
Organism:Homo sapiens (Human)
Description:O00763
Residue:2458
BDBM50355931
NameBDBM50355931
Synonyms:CHEMBL1910401
TypeSmall organic molecule
Emp. Form.C31H42N4O4S
Mol. Mass.566.755
SMILESCC1(C)CC2(CCCN(C2)C2CCN(CC2)C(=O)c2c(NC(=O)NC3CCCCC3)sc3ccccc23)C(=O)O1