Reaction Details
TargetHistamine H4 receptor
LigandBDBM22566
Substrate/Competitorn/a
Meas. Tech.ChEMBL_785117 (CHEMBL1920855)
Ki 8±n/a nM
Citation Mowbray, CEBell, ASClarke, NPCollins, MJones, RMLane, CALiu, WLNewman, SDParadowski, MSchenck, EJSelby, MDSwain, NAWilliams, DH Challenges of drug discovery in novel target space. The discovery and evaluation of PF-3893787: a novel histamine H4 receptor antagonist. Bioorg Med Chem Lett21:6596-602 (2011) 
 
Histamine H4 receptor
Name:Histamine H4 receptor
Type:G Protein-Coupled Receptor (GPCR)
Mol. Mass.:44517.02
Organism:Homo sapiens (Human)
Description:Binding assays were using CHO cells stably expressing hH4R receptors.
Residue:390
BDBM22566
NameBDBM22566
Synonyms:5-chloro-2-[(4-methylpiperazin-1-yl)carbonyl]-1H-indole JNJ 7777120
TypeSmall organic molecule
Emp. Form.C14H16ClN3O
Mol. Mass.277.749
SMILESCN1CCN(CC1)C(=O)c1cc2cc(Cl)ccc2[nH]1