Reaction Details
TargetHistamine H4 receptor
LigandBDBM50356885
Substrate/Competitorn/a
Meas. Tech.ChEMBL_785117 (CHEMBL1920855)
Ki 16±n/a nM
Citation Mowbray, CEBell, ASClarke, NPCollins, MJones, RMLane, CALiu, WLNewman, SDParadowski, MSchenck, EJSelby, MDSwain, NAWilliams, DH Challenges of drug discovery in novel target space. The discovery and evaluation of PF-3893787: a novel histamine H4 receptor antagonist. Bioorg Med Chem Lett21:6596-602 (2011) 
 
Histamine H4 receptor
Name:Histamine H4 receptor
Type:G Protein-Coupled Receptor (GPCR)
Mol. Mass.:44517.02
Organism:Homo sapiens (Human)
Description:Binding assays were using CHO cells stably expressing hH4R receptors.
Residue:390
BDBM50356885
NameBDBM50356885
Synonyms:CHEMBL1915345
TypeSmall organic molecule
Emp. Form.C16H18ClN3O
Mol. Mass.303.787
SMILESCN1C[C@H]2CN(C[C@H]2C1)C(=O)c1cc2cc(Cl)ccc2[nH]1