Reaction Details
TargetHistamine H4 receptor
LigandBDBM50356887
Substrate/Competitorn/a
Meas. Tech.ChEMBL_785118 (CHEMBL1920856)
Ki 53±n/a nM
Citation Mowbray, CEBell, ASClarke, NPCollins, MJones, RMLane, CALiu, WLNewman, SDParadowski, MSchenck, EJSelby, MDSwain, NAWilliams, DH Challenges of drug discovery in novel target space. The discovery and evaluation of PF-3893787: a novel histamine H4 receptor antagonist. Bioorg Med Chem Lett21:6596-602 (2011) 
 
Histamine H4 receptor
Name:Histamine H4 receptor
Type:G Protein-Coupled Receptor (GPCR)
Mol. Mass.:44517.02
Organism:Homo sapiens (Human)
Description:Binding assays were using CHO cells stably expressing hH4R receptors.
Residue:390
BDBM50356887
NameBDBM50356887
Synonyms:CHEMBL1915347
TypeSmall organic molecule
Emp. Form.C15H16F2N4O
Mol. Mass.306.3105
SMILESCN1C[C@H]2CN(C[C@H]2C1)C(=O)c1nc2cc(F)c(F)cc2[nH]1