Reaction Details
TargetAndrogen receptor
LigandBDBM50356986
Substrate/Competitorn/a
Meas. Tech.ChEMBL_788156 (CHEMBL1919237)
IC50 75±n/a nM
Citation Guo, CLinton, AKephart, SOrnelas, MPairish, MGonzalez, JGreasley, SNagata, ABurke, BJEdwards, MHosea, NKang, PHu, WEngebretsen, JBriere, DShi, MGukasyan, HRichardson, PDack, KUnderwood, TJohnson, PMorell, AFelstead, RKuruma, HMatsimoto, HZoubeidi, AGleave, MLos, GFanjul, AN Discovery of aryloxy tetramethylcyclobutanes as novel androgen receptor antagonists. J Med Chem54:7693-704 (2011) 
 
Androgen receptor
Name:Androgen receptor
Type:Receptor
Mol. Mass.:99185.27
Organism:Homo sapiens (Human)
Description:CHO cells were stably transfected with human AR gene.
Residue:920
BDBM50356986
NameBDBM50356986
Synonyms:CHEMBL1916243
TypeSmall organic molecule
Emp. Form.C19H21ClN4O2
Mol. Mass.372.849
SMILESCC1(C)[C@H](NC(=O)c2ccn[nH]2)C(C)(C)[C@H]1Oc1ccc(C#N)c(Cl)c1