Reaction Details
TargetTyrosine-protein kinase BTK
LigandBDBM50357315
Substrate/Competitorn/a
Meas. Tech.ChEMBL_788548 (CHEMBL1918488)
IC50 2.52±n/a nM
Citation Kim, KHMaderna, ASchnute, MEHegen, MMohan, SMiyashiro, JLin, LLi, EKeegan, SLussier, JWrocklage, CNickerson-Nutter, CLWittwer, AJSoutter, HCaspers, NHan, SKurumbail, RDunussi-Joannopoulos, KDouhan, JWissner, A Imidazo[1,5-a]quinoxalines as irreversible BTK inhibitors for the treatment of rheumatoid arthritis. Bioorg Med Chem Lett21:6258-63 (2011) 
 
Tyrosine-protein kinase BTK
Name:Tyrosine-protein kinase BTK
Type:Enzyme
Mol. Mass.:76289.95
Organism:Homo sapiens (Human)
Description:Q06187
Residue:659
BDBM50357315
NameBDBM50357315
Synonyms:CHEMBL1916714
TypeSmall organic molecule
Emp. Form.C26H28N6O3
Mol. Mass.472.5389
SMILESCOc1cc2nc(Nc3ccccc3C)c3cncn3c2cc1NC(=O)C(=C)CN1CCOCC1