Reaction Details
TargetTyrosine-protein kinase BTK
LigandBDBM50357323
Substrate/Competitorn/a
Meas. Tech.ChEMBL_788548 (CHEMBL1918488)
IC50 2.96±n/a nM
Citation Kim, KHMaderna, ASchnute, MEHegen, MMohan, SMiyashiro, JLin, LLi, EKeegan, SLussier, JWrocklage, CNickerson-Nutter, CLWittwer, AJSoutter, HCaspers, NHan, SKurumbail, RDunussi-Joannopoulos, KDouhan, JWissner, A Imidazo[1,5-a]quinoxalines as irreversible BTK inhibitors for the treatment of rheumatoid arthritis. Bioorg Med Chem Lett21:6258-63 (2011) 
 
Tyrosine-protein kinase BTK
Name:Tyrosine-protein kinase BTK
Type:Enzyme
Mol. Mass.:76289.95
Organism:Homo sapiens (Human)
Description:Q06187
Residue:659
BDBM50357323
NameBDBM50357323
Synonyms:CHEMBL1916881
TypeSmall organic molecule
Emp. Form.C24H25FN6O
Mol. Mass.432.4933
SMILESCN(C)C\C=C\C(=O)N(C)c1ccc2nc(Nc3ccc(F)cc3C)c3cncn3c2c1