Reaction Details
TargetTyrosine-protein kinase BTK
LigandBDBM50357338
Substrate/Competitorn/a
Meas. Tech.ChEMBL_788548 (CHEMBL1918488)
IC50 5.03±n/a nM
Citation Kim, KHMaderna, ASchnute, MEHegen, MMohan, SMiyashiro, JLin, LLi, EKeegan, SLussier, JWrocklage, CNickerson-Nutter, CLWittwer, AJSoutter, HCaspers, NHan, SKurumbail, RDunussi-Joannopoulos, KDouhan, JWissner, A Imidazo[1,5-a]quinoxalines as irreversible BTK inhibitors for the treatment of rheumatoid arthritis. Bioorg Med Chem Lett21:6258-63 (2011) 
 
Tyrosine-protein kinase BTK
Name:Tyrosine-protein kinase BTK
Type:Enzyme
Mol. Mass.:76289.95
Organism:Homo sapiens (Human)
Description:Q06187
Residue:659
BDBM50357338
NameBDBM50357338
Synonyms:CHEMBL1916896
TypeSmall organic molecule
Emp. Form.C23H22Cl2N6O
Mol. Mass.469.366
SMILESCN(C)C\C=C\C(=O)N(C)c1cc2c(cc1Cl)nc(Nc1ccccc1Cl)c1cncn21