Reaction Details
TargetTyrosine-protein kinase Lyn
LigandBDBM50357316
Substrate/Competitorn/a
Meas. Tech.ChEMBL_788549 (CHEMBL1918489)
IC50 10.9±n/a nM
Citation Kim, KHMaderna, ASchnute, MEHegen, MMohan, SMiyashiro, JLin, LLi, EKeegan, SLussier, JWrocklage, CNickerson-Nutter, CLWittwer, AJSoutter, HCaspers, NHan, SKurumbail, RDunussi-Joannopoulos, KDouhan, JWissner, A Imidazo[1,5-a]quinoxalines as irreversible BTK inhibitors for the treatment of rheumatoid arthritis. Bioorg Med Chem Lett21:6258-63 (2011) 
 
Tyrosine-protein kinase Lyn
Name:Tyrosine-protein kinase Lyn
Type:Protein
Mol. Mass.:58575.92
Organism:Homo sapiens (Human)
Description:P07948
Residue:512
BDBM50357316
NameBDBM50357316
Synonyms:CHEMBL1916715
TypeSmall organic molecule
Emp. Form.C24H26N6O2
Mol. Mass.430.5022
SMILESCOc1cc2nc(Nc3ccccc3C)c3cncn3c2cc1NC(=O)\C=C\CN(C)C