Reaction Details
TargetTyrosine-protein kinase Blk
LigandBDBM50357333
Substrate/Competitorn/a
Meas. Tech.ChEMBL_787370 (CHEMBL1919249)
IC50 16±n/a nM
Citation Kim, KHMaderna, ASchnute, MEHegen, MMohan, SMiyashiro, JLin, LLi, EKeegan, SLussier, JWrocklage, CNickerson-Nutter, CLWittwer, AJSoutter, HCaspers, NHan, SKurumbail, RDunussi-Joannopoulos, KDouhan, JWissner, A Imidazo[1,5-a]quinoxalines as irreversible BTK inhibitors for the treatment of rheumatoid arthritis. Bioorg Med Chem Lett21:6258-63 (2011) 
 
Tyrosine-protein kinase Blk
Name:Tyrosine-protein kinase Blk
Type:Protein
Mol. Mass.:57711.88
Organism:Homo sapiens (Human)
Description:P51451
Residue:505
BDBM50357333
NameBDBM50357333
Synonyms:CHEMBL1916891
TypeSmall organic molecule
Emp. Form.C24H25FN6O
Mol. Mass.432.4933
SMILESCN(C)C\C=C\C(=O)N(C)c1cc2c(cc1F)nc(Nc1ccccc1C)c1cncn21