Reaction Details
TargetHepatocyte growth factor receptor
LigandBDBM50358293
Substrate/Competitorn/a
Meas. Tech.ChEMBL_790945 (CHEMBL1925561)
IC50 27±n/a nM
Citation Ryu, JWHan, SYYun, JIChoi, SUJung, HHa, JDCho, SYLee, COKang, NSKoh, JSKim, HRLee, J Design and synthesis of triazolopyridazines substituted with methylisoquinolinone as selective c-Met kinase inhibitors. Bioorg Med Chem Lett21:7185-8 (2011) 
 
Hepatocyte growth factor receptor
Name:Hepatocyte growth factor receptor
Type:Protein
Mol. Mass.:155559.73
Organism:Homo sapiens (Human)
Description:P08581
Residue:1390
BDBM50358293
NameBDBM50358293
Synonyms:CHEMBL1922408
TypeSmall organic molecule
Emp. Form.C19H18N6O
Mol. Mass.346.3858
SMILESO=c1[nH]ccc2c(Cc3nnc4ccc(nn34)N3CCCC3)cccc12