Reaction Details
TargetArachidonate 5-lipoxygenase-activating protein
LigandBDBM50359092
Substrate/Competitorn/a
Meas. Tech.ChEMBL_789497 (CHEMBL1924524)
IC50 1.5±n/a nM
Citation Stock, NSBain, GZunic, JLi, YZiff, JRoppe, JSantini, ADarlington, JProdanovich, PKing, CDBaccei, CLee, CRong, HChapman, CBroadhead, ALorrain, DCorrea, LHutchinson, JHEvans, JFPrasit, P 5-Lipoxygenase-activating protein (FLAP) inhibitors. Part 4: development of 3-[3-tert-butylsulfanyl-1-[4-(6-ethoxypyridin-3-yl)benzyl]-5-(5-methylpyridin-2-ylmethoxy)-1H-indol-2-yl]-2,2-dimethylpropionic acid (AM803), a potent, oral, once daily FLAP inhibitor. J Med Chem54:8013-29 (2011) 
 
Arachidonate 5-lipoxygenase-activating protein
Name:Arachidonate 5-lipoxygenase-activating protein
Type:Enzyme
Mol. Mass.:18159.90
Organism:Homo sapiens (Human)
Description:P20292
Residue:161
BDBM50359092
NameBDBM50359092
Synonyms:CHEMBL1922671
TypeSmall organic molecule
Emp. Form.C40H45N3O5
Mol. Mass.647.8024
SMILESCCOc1ccc(cn1)-c1ccc(Cn2c(CC(C)(C)C(O)=O)c(C(=O)CC(C)(C)C)c3cc(OCc4ccc(C)cn4)ccc23)cc1