Reaction Details
TargetArachidonate 5-lipoxygenase-activating protein
LigandBDBM50359086
Substrate/Competitorn/a
Meas. Tech.ChEMBL_789491 (CHEMBL1924518)
IC50 0.600000±n/a nM
Citation Stock, NSBain, GZunic, JLi, YZiff, JRoppe, JSantini, ADarlington, JProdanovich, PKing, CDBaccei, CLee, CRong, HChapman, CBroadhead, ALorrain, DCorrea, LHutchinson, JHEvans, JFPrasit, P 5-Lipoxygenase-activating protein (FLAP) inhibitors. Part 4: development of 3-[3-tert-butylsulfanyl-1-[4-(6-ethoxypyridin-3-yl)benzyl]-5-(5-methylpyridin-2-ylmethoxy)-1H-indol-2-yl]-2,2-dimethylpropionic acid (AM803), a potent, oral, once daily FLAP inhibitor. J Med Chem54:8013-29 (2011) 
 
Arachidonate 5-lipoxygenase-activating protein
Name:Arachidonate 5-lipoxygenase-activating protein
Type:Enzyme
Mol. Mass.:18159.90
Organism:Homo sapiens (Human)
Description:P20292
Residue:161
BDBM50359086
NameBDBM50359086
Synonyms:CHEMBL1922666
TypeSmall organic molecule
Emp. Form.C36H39N3O3S
Mol. Mass.593.778
SMILESCc1ccc(COc2ccc3n(Cc4ccc(cc4)-c4ccccn4)c(CC(C)(C)C(O)=O)c(SC(C)(C)C)c3c2)nc1