Reaction Details
TargetHepatocyte growth factor receptor
LigandBDBM50359982
Substrate/Competitorn/a
Meas. Tech.ChEMBL_791160 (CHEMBL1929610)
IC50 1194±n/a nM
Citation Furlan, AColombo, FKover, AIssaly, NTintori, CAngeli, LLeroux, VLetard, SAmat, MAsses, YMaigret, BDubreuil, PBotta, MDono, RBosch, JPiccolo, OPassarella, DMaina, F Identification of new aminoacid amides containing the imidazo[2,1-b]benzothiazol-2-ylphenyl moiety as inhibitors of tumorigenesis by oncogenic Met signaling. Eur J Med Chem47:239-54 (2012) 
 
Hepatocyte growth factor receptor
Name:Hepatocyte growth factor receptor
Type:Protein
Mol. Mass.:155559.73
Organism:Homo sapiens (Human)
Description:P08581
Residue:1390
BDBM50359982
NameBDBM50359982
Synonyms:CHEMBL1927771
TypeSmall organic molecule
Emp. Form.C34H24F6N4O2S
Mol. Mass.666.635
SMILESFC(F)(F)c1cc(CC(=O)N[C@H](Cc2ccccc2)C(=O)Nc2ccc(cc2)-c2cn3c(n2)sc2ccccc32)cc(c1)C(F)(F)F