Reaction Details
TargetHepatocyte growth factor receptor
LigandBDBM50341636
Substrate/Competitorn/a
Meas. Tech.ChEMBL_791160 (CHEMBL1929610)
IC50 228±n/a nM
Citation Furlan, AColombo, FKover, AIssaly, NTintori, CAngeli, LLeroux, VLetard, SAmat, MAsses, YMaigret, BDubreuil, PBotta, MDono, RBosch, JPiccolo, OPassarella, DMaina, F Identification of new aminoacid amides containing the imidazo[2,1-b]benzothiazol-2-ylphenyl moiety as inhibitors of tumorigenesis by oncogenic Met signaling. Eur J Med Chem47:239-54 (2012) 
 
Hepatocyte growth factor receptor
Name:Hepatocyte growth factor receptor
Type:Protein
Mol. Mass.:155559.73
Organism:Homo sapiens (Human)
Description:P08581
Residue:1390
BDBM50341636
NameBDBM50341636
Synonyms:(3Z)-N-(3-CHLOROPHENYL)-3-({3,5-DIMETHYL-4-[(4-METHYLPIPERAZIN-1-YL)CARBONYL]-1H-PYRROL-2-YL}METHYLENE)-N-METHYL-2-OXOINDOLINE-5-SULFONAMIDE (3Z)-N-(3-chlorophenyl)-3-({3,5-dimethyl-4-[(4-methylpiperazin-1-yl)carbonyl]-1H-pyrrol-2-yl}methylene)-N-methyl-2-oxo-2,3-dihydro-1H-indole-5-sulfonamide N-(3-chlorophenyl)-3-((3,5-dimethyl-4-(1-methylpiperazine-4-carbonyl)-1H-pyrrol-2-yl)methylene)-N-methyl-2-oxoindoline-5-sulfonamide SU-11274
TypeSmall organic molecule
Emp. Form.C28H30ClN5O4S
Mol. Mass.568.087
SMILESCN(c1cccc(Cl)c1)S(=O)(=O)c1ccc2NC(=O)\C(=C/c3[nH]c(C)c(C(=O)N4CCN(C)CC4)c3C)c2c1