Reaction Details
TargetReceptor tyrosine-protein kinase erbB-2
LigandBDBM50360462
Substrate/Competitorn/a
Meas. Tech.ChEMBL_795516 (CHEMBL1935839)
IC50 110±n/a nM
Citation Suzuki, NShiota, TWatanabe, FHaga, NMurashi, TOhara, TMatsuo, KOmori, NYari, HDohi, KInoue, MIguchi, MSentou, JWada, T Discovery of novel 5-alkynyl-4-anilinopyrimidines as potent, orally active dual inhibitors of EGFR and Her-2 tyrosine kinases. Bioorg Med Chem Lett22:456-60 (2011) 
 
Receptor tyrosine-protein kinase erbB-2
Name:Receptor tyrosine-protein kinase erbB-2
Type:n/a
Mol. Mass.:137894.47
Organism:Homo sapiens (Human)
Description:P04626
Residue:1255
BDBM50360462
NameBDBM50360462
Synonyms:CHEMBL1934629
TypeSmall organic molecule
Emp. Form.C28H25ClFN5OS
Mol. Mass.534.047
SMILESCc1ncnc(Nc2ccc(OCc3cccc(F)c3)c(Cl)c2)c1C#Cc1ncc(CN2CCCC2)s1