Reaction Details
TargetReceptor tyrosine-protein kinase erbB-2
LigandBDBM50360466
Substrate/Competitorn/a
Meas. Tech.ChEMBL_795516 (CHEMBL1935839)
IC50 30±n/a nM
Citation Suzuki, NShiota, TWatanabe, FHaga, NMurashi, TOhara, TMatsuo, KOmori, NYari, HDohi, KInoue, MIguchi, MSentou, JWada, T Discovery of novel 5-alkynyl-4-anilinopyrimidines as potent, orally active dual inhibitors of EGFR and Her-2 tyrosine kinases. Bioorg Med Chem Lett22:456-60 (2011) 
 
Receptor tyrosine-protein kinase erbB-2
Name:Receptor tyrosine-protein kinase erbB-2
Type:n/a
Mol. Mass.:137894.47
Organism:Homo sapiens (Human)
Description:P04626
Residue:1255
BDBM50360466
NameBDBM50360466
Synonyms:CHEMBL1934632
TypeSmall organic molecule
Emp. Form.C30H30ClFN4O
Mol. Mass.517.037
SMILESCC(C)NCc1ccc(\C=C\c2c(C)ncnc2Nc2ccc(OCc3cccc(F)c3)c(Cl)c2)cc1