Reaction Details
TargetTyrosine-protein kinase
LigandBDBM50360608
Substrate/Competitorn/a
Meas. Tech.ChEMBL_795546 (CHEMBL1935924)
IC50 4410±n/a nM
Citation Powell, NAKohrt, JTFilipski, KJKaufman, MSheehan, DEdmunds, JEDelaney, AWang, YBourbonais, FLee, DYSchwende, FSun, FMcConnell, PCatana, CChen, HOhren, JPerrin, LA Novel and selective spiroindoline-based inhibitors of Sky kinase. Bioorg Med Chem Lett22:190-3 (2011) 
 
Tyrosine-protein kinase
Name:Tyrosine-protein kinase
Synonyms:Syk protein
Type:PROTEIN
Mol. Mass.:71353.61
Organism:Mus musculus
Description:ChEMBL_795546
Residue:629
BDBM50360608
NameBDBM50360608
Synonyms:CHEMBL1933072
TypeSmall organic molecule
Emp. Form.C26H29FN4O
Mol. Mass.432.5331
SMILESFc1ccc2[nH]c(cc2c1)C(=O)N1C[C@]2(CCN(CC3CCCNC3)C2)c2ccccc12