Reaction Details
TargetMelanin-concentrating hormone receptor 2
LigandBDBM50360709
Substrate/Competitorn/a
Meas. Tech.ChEMBL_795932 (CHEMBL1936805)
IC50 10±n/a nM
Citation Chen, XMihalic, JFan, PLiang, LLindstrom, MWong, SYe, QFu, YJaen, JChen, JLDai, KLi, L Discovery and characterization of a potent and selective antagonist of melanin-concentrating hormone receptor 2. Bioorg Med Chem Lett22:363-6 (2011) 
 
Melanin-concentrating hormone receptor 2
Name:Melanin-concentrating hormone receptor 2
Type:Enzyme Catalytic Domain
Mol. Mass.:38862.16
Organism:Homo sapiens (Human)
Description:Melanin Concentrating Hormone 2 GPR145 HUMAN::Q969V1
Residue:340
BDBM50360709
NameBDBM50360709
Synonyms:CHEMBL1934128
TypeSmall organic molecule
Emp. Form.C28H28BrN3O
Mol. Mass.502.445
SMILESCC(=O)N[C@@H]1CC2(CCN(Cc3ccc4[nH]c5ccc(Br)cc5c4c3)CC2)c2ccccc12