Reaction Details
TargetMelanin-concentrating hormone receptor 2
LigandBDBM50360711
Substrate/Competitorn/a
Meas. Tech.ChEMBL_795932 (CHEMBL1936805)
IC50 200±n/a nM
Citation Chen, XMihalic, JFan, PLiang, LLindstrom, MWong, SYe, QFu, YJaen, JChen, JLDai, KLi, L Discovery and characterization of a potent and selective antagonist of melanin-concentrating hormone receptor 2. Bioorg Med Chem Lett22:363-6 (2011) 
 
Melanin-concentrating hormone receptor 2
Name:Melanin-concentrating hormone receptor 2
Type:Enzyme Catalytic Domain
Mol. Mass.:38862.16
Organism:Homo sapiens (Human)
Description:Melanin Concentrating Hormone 2 GPR145 HUMAN::Q969V1
Residue:340
BDBM50360711
NameBDBM50360711
Synonyms:CHEMBL1934115
TypeSmall organic molecule
Emp. Form.C28H30N2O
Mol. Mass.410.5506
SMILESCCn1c2ccccc2c2cc(CN3CCC4(CC(O)c5ccccc45)CC3)ccc12