Reaction Details
TargetProtein tyrosine phosphatase type IVA 3
LigandBDBM11318
Substrate/Competitorn/a
Meas. Tech.ChEMBL_795371 (CHEMBL1937271)
IC50 3500±n/a nM
Citation Han, YMLee, SKJeong, DGRyu, SEHan, DCKim, DKKwon, BM Emodin inhibits migration and invasion of DLD-1 (PRL-3) cells via inhibition of PRL-3 phosphatase activity. Bioorg Med Chem Lett22:323-6 (2011) 
 
Protein tyrosine phosphatase type IVA 3
Name:Protein tyrosine phosphatase type IVA 3
Type:PROTEIN
Mol. Mass.:19546.22
Organism:Homo sapiens (Human)
Description:ChEMBL_1461022
Residue:173
BDBM11318
NameBDBM11318
Synonyms:1,3,8-trihydroxy-6-methyl-9,10-dihydroanthracene-9,10-dione CHEMBL289277 US20230364057, Compound 242 | med.21724, Compound 24
TypeSmall organic molecule
Emp. Form.C15H10O5
Mol. Mass.270.2369
SMILESCc1cc(O)c2C(=O)c3c(O)cc(O)cc3C(=O)c2c1