Reaction Details
TargetTyrosine-protein kinase JAK2
LigandBDBM50361218
Substrate/Competitorn/a
Meas. Tech.ChEMBL_794849 (CHEMBL1936085)
IC50 282±n/a nM
Citation Zificsak, CAGingrich, DEBreslin, HJDunn, DDMilkiewicz, KLTheroff, JPThieu, TVUnderiner, TLWeinberg, LRAimone, LDAlbom, MSMason, JLSaville, LHusten, JAngeles, TSFinn, JPJan, MO'Kane, TMDobrzanski, PDorsey, BD Optimization of a novel kinase inhibitor scaffold for the dual inhibition of JAK2 and FAK kinases. Bioorg Med Chem Lett22:133-7 (2011) 
 
Tyrosine-protein kinase JAK2
Name:Tyrosine-protein kinase JAK2
Type:Protein
Mol. Mass.:130684.68
Organism:Homo sapiens (Human)
Description:O60674
Residue:1132
BDBM50361218
NameBDBM50361218
Synonyms:CHEMBL1934347
TypeSmall organic molecule
Emp. Form.C23H24N8O
Mol. Mass.428.4897
SMILESNC(=O)CN1CCC(CC1)c1ccc(Nc2ncc3ccc(-c4cnccn4)n3n2)cc1