Reaction Details
TargetFocal adhesion kinase 1
LigandBDBM50361211
Substrate/Competitorn/a
Meas. Tech.ChEMBL_794825 (CHEMBL1936008)
IC50>10000±n/a nM
Citation Zificsak, CAGingrich, DEBreslin, HJDunn, DDMilkiewicz, KLTheroff, JPThieu, TVUnderiner, TLWeinberg, LRAimone, LDAlbom, MSMason, JLSaville, LHusten, JAngeles, TSFinn, JPJan, MO'Kane, TMDobrzanski, PDorsey, BD Optimization of a novel kinase inhibitor scaffold for the dual inhibition of JAK2 and FAK kinases. Bioorg Med Chem Lett22:133-7 (2011) 
 
Focal adhesion kinase 1
Name:Focal adhesion kinase 1
Type:Tyrosine-protein kinase
Mol. Mass.:119233.17
Organism:Homo sapiens (Human)
Description:Q05397
Residue:1052
BDBM50361211
NameBDBM50361211
Synonyms:CHEMBL1934340
TypeSmall organic molecule
Emp. Form.C27H31N7O3S
Mol. Mass.533.645
SMILESCN(c1cccc(c1)-c1ccc2cnc(Nc3ccc(cc3)C3CCN(CC(N)=O)CC3)nn12)S(C)(=O)=O