Reaction Details
TargetHepatocyte growth factor receptor
LigandBDBM50361562
Substrate/Competitorn/a
Meas. Tech.ChEMBL_797073 (CHEMBL1944394)
IC50 28±n/a nM
Citation Milkiewicz, KLAimone, LDAlbom, MSAngeles, TSChang, HGrobelny, JVHusten, JLosardo, CMiknyoczki, SMurthy, SRolon-Steele, DUnderiner, TLWeinberg, LRWorrell, CSZeigler, KSDorsey, BD Improvement in oral bioavailability of 2,4-diaminopyrimidine c-Met inhibitors by incorporation of a 3-amidobenzazepin-2-one group. Bioorg Med Chem19:6274-84 (2011) 
 
Hepatocyte growth factor receptor
Name:Hepatocyte growth factor receptor
Type:Protein
Mol. Mass.:155559.73
Organism:Homo sapiens (Human)
Description:P08581
Residue:1390
BDBM50361562
NameBDBM50361562
Synonyms:CHEMBL1939488
TypeSmall organic molecule
Emp. Form.C27H29ClFN7O4
Mol. Mass.570.015
SMILESCNC(=O)c1cccc(F)c1Nc1nc(Nc2ccc3c(NC(=O)[C@@H](CC3(C)C)NC(=O)COC)c2)ncc1Cl