Reaction Details
TargetHepatocyte growth factor receptor
LigandBDBM50361560
Substrate/Competitorn/a
Meas. Tech.ChEMBL_797073 (CHEMBL1944394)
IC50 26±n/a nM
Citation Milkiewicz, KLAimone, LDAlbom, MSAngeles, TSChang, HGrobelny, JVHusten, JLosardo, CMiknyoczki, SMurthy, SRolon-Steele, DUnderiner, TLWeinberg, LRWorrell, CSZeigler, KSDorsey, BD Improvement in oral bioavailability of 2,4-diaminopyrimidine c-Met inhibitors by incorporation of a 3-amidobenzazepin-2-one group. Bioorg Med Chem19:6274-84 (2011) 
 
Hepatocyte growth factor receptor
Name:Hepatocyte growth factor receptor
Type:Protein
Mol. Mass.:155559.73
Organism:Homo sapiens (Human)
Description:P08581
Residue:1390
BDBM50361560
NameBDBM50361560
Synonyms:CHEMBL1939486
TypeSmall organic molecule
Emp. Form.C26H24ClF4N7O3
Mol. Mass.593.96
SMILESCNC(=O)c1cccc(F)c1Nc1nc(Nc2ccc3c(NC(=O)[C@@H](CC3(C)C)NC(=O)C(F)(F)F)c2)ncc1Cl