Reaction Details
TargetInsulin receptor
LigandBDBM50334084
Substrate/Competitorn/a
Meas. Tech.ChEMBL_796984 (CHEMBL1944059)
IC50 153±n/a nM
Citation Milkiewicz, KLAimone, LDAlbom, MSAngeles, TSChang, HGrobelny, JVHusten, JLosardo, CMiknyoczki, SMurthy, SRolon-Steele, DUnderiner, TLWeinberg, LRWorrell, CSZeigler, KSDorsey, BD Improvement in oral bioavailability of 2,4-diaminopyrimidine c-Met inhibitors by incorporation of a 3-amidobenzazepin-2-one group. Bioorg Med Chem19:6274-84 (2011) 
 
Insulin receptor
Name:Insulin receptor
Type:Receptor Tyrosine Kinase
Mol. Mass.:156322.60
Organism:Homo sapiens (Human)
Description:P06213
Residue:1382
BDBM50334084
NameBDBM50334084
Synonyms:2-[5-Chloro-2-(5,5-dimethyl-2-oxo-2,3,4,5-tetrahydro-1H-benzo[b]azepin-8-ylamino)-pyrimidin-4-ylamino]-3-fluoro-N-methyl-benzamide | CHEMBL1644811
TypeSmall organic molecule
Emp. Form.C24H24ClFN6O2
Mol. Mass.482.938
SMILESCNC(=O)c1cccc(F)c1Nc1nc(Nc2ccc3c(NC(=O)CCC3(C)C)c2)ncc1Cl