Reaction Details
TargetInsulin receptor
LigandBDBM50361561
Substrate/Competitorn/a
Meas. Tech.ChEMBL_796984 (CHEMBL1944059)
IC50 945±n/a nM
Citation Milkiewicz, KLAimone, LDAlbom, MSAngeles, TSChang, HGrobelny, JVHusten, JLosardo, CMiknyoczki, SMurthy, SRolon-Steele, DUnderiner, TLWeinberg, LRWorrell, CSZeigler, KSDorsey, BD Improvement in oral bioavailability of 2,4-diaminopyrimidine c-Met inhibitors by incorporation of a 3-amidobenzazepin-2-one group. Bioorg Med Chem19:6274-84 (2011) 
 
Insulin receptor
Name:Insulin receptor
Type:Receptor Tyrosine Kinase
Mol. Mass.:156322.60
Organism:Homo sapiens (Human)
Description:P06213
Residue:1382
BDBM50361561
NameBDBM50361561
Synonyms:CHEMBL1939487
TypeSmall organic molecule
Emp. Form.C26H24ClF4N7O3
Mol. Mass.593.96
SMILESCNC(=O)c1cccc(F)c1Nc1nc(Nc2ccc3c(NC(=O)[C@H](CC3(C)C)NC(=O)C(F)(F)F)c2)ncc1Cl