Reaction Details
TargetHepatocyte growth factor receptor
LigandBDBM50361558
Substrate/Competitorn/a
Meas. Tech.ChEMBL_797073 (CHEMBL1944394)
IC50 18±n/a nM
Citation Milkiewicz, KLAimone, LDAlbom, MSAngeles, TSChang, HGrobelny, JVHusten, JLosardo, CMiknyoczki, SMurthy, SRolon-Steele, DUnderiner, TLWeinberg, LRWorrell, CSZeigler, KSDorsey, BD Improvement in oral bioavailability of 2,4-diaminopyrimidine c-Met inhibitors by incorporation of a 3-amidobenzazepin-2-one group. Bioorg Med Chem19:6274-84 (2011) 
 
Hepatocyte growth factor receptor
Name:Hepatocyte growth factor receptor
Type:Protein
Mol. Mass.:155559.73
Organism:Homo sapiens (Human)
Description:P08581
Residue:1390
BDBM50361558
NameBDBM50361558
Synonyms:CHEMBL1939484
TypeSmall organic molecule
Emp. Form.C29H32ClFN8O3
Mol. Mass.595.068
SMILESCNC(=O)c1cccc(F)c1Nc1nc(Nc2ccc3c(NC(=O)C(CC3(C)C)NC(=O)N3CCCC3)c2)ncc1Cl