Reaction Details
TargetHistamine H4 receptor
LigandBDBM50179335
Substrate/Competitorn/a
Meas. Tech.ChEMBL_798257 (CHEMBL1943644)
Ki 39.6±n/a nM
Citation Lane, CAHay, DMowbray, CEParadowski, MSelby, MDSwain, NAWilliams, DH Synthesis of novel histamine H4 receptor antagonists. Bioorg Med Chem Lett22:1156-9 (2012) 
 
Histamine H4 receptor
Name:Histamine H4 receptor
Type:G Protein-Coupled Receptor (GPCR)
Mol. Mass.:44517.02
Organism:Homo sapiens (Human)
Description:Binding assays were using CHO cells stably expressing hH4R receptors.
Residue:390
BDBM50179335
NameBDBM50179335
Synonyms:(5-Chloro-1H-benzoimidazol-2-yl)-(4-methyl-piperazin-1-yl)-methanone CHEMBL185951
TypeSmall organic molecule
Emp. Form.C13H15ClN4O
Mol. Mass.278.737
SMILESCN1CCN(CC1)C(=O)c1nc2ccc(Cl)cc2[nH]1