Reaction Details
TargetMitogen-activated protein kinase 1
LigandBDBM50363957
Substrate/Competitorn/a
Meas. Tech.ChEMBL_803384 (CHEMBL1952843)
IC50 3040±n/a nM
Citation McDermott, LASimcox, MHiggins, BNevins, TKolinsky, KSmith, MYang, HLi, JKChen, YKe, JMallalieu, NEgan, TKolis, SRailkar, AGerber, LLuk, KC RO4383596, an orally active KDR, FGFR, and PDGFR inhibitor: synthesis and biological evaluation. Bioorg Med Chem13:4835-41 (2005) 
 
Mitogen-activated protein kinase 1
Name:Mitogen-activated protein kinase 1
Type:Ser/Thr Protein Kinase
Mol. Mass.:41392.76
Organism:Homo sapiens (Human)
Description:P28482
Residue:360
BDBM50363957
NameBDBM50363957
Synonyms:CHEMBL1952210
TypeSmall organic molecule
Emp. Form.C24H25N5O3
Mol. Mass.431.487
SMILESCOc1ccc(cc1)N1Cc2cnc(Nc3ccccc3)nc2N([C@@H]2CC[C@@H](O)C2)C1=O