Reaction Details
TargetSerine/threonine-protein kinase Sgk1
LigandBDBM50363957
Substrate/Competitorn/a
Meas. Tech.ChEMBL_803385 (CHEMBL1952844)
IC50>125000±n/a nM
Citation McDermott, LASimcox, MHiggins, BNevins, TKolinsky, KSmith, MYang, HLi, JKChen, YKe, JMallalieu, NEgan, TKolis, SRailkar, AGerber, LLuk, KC RO4383596, an orally active KDR, FGFR, and PDGFR inhibitor: synthesis and biological evaluation. Bioorg Med Chem13:4835-41 (2005) 
 
Serine/threonine-protein kinase Sgk1
Name:Serine/threonine-protein kinase Sgk1
Type:Other Protein Type
Mol. Mass.:48954.40
Organism:Homo sapiens (Human)
Description:Recombinant human SGK-1 enzyme produced in a baculovirus system.
Residue:431
BDBM50363957
NameBDBM50363957
Synonyms:CHEMBL1952210
TypeSmall organic molecule
Emp. Form.C24H25N5O3
Mol. Mass.431.487
SMILESCOc1ccc(cc1)N1Cc2cnc(Nc3ccccc3)nc2N([C@@H]2CC[C@@H](O)C2)C1=O