Reaction Details
TargetVascular endothelial growth factor receptor 2
LigandBDBM50363958
Substrate/Competitorn/a
Meas. Tech.ChEMBL_803378 (CHEMBL1952837)
IC50 15±n/a nM
Citation McDermott, LASimcox, MHiggins, BNevins, TKolinsky, KSmith, MYang, HLi, JKChen, YKe, JMallalieu, NEgan, TKolis, SRailkar, AGerber, LLuk, KC RO4383596, an orally active KDR, FGFR, and PDGFR inhibitor: synthesis and biological evaluation. Bioorg Med Chem13:4835-41 (2005) 
 
Vascular endothelial growth factor receptor 2
Name:Vascular endothelial growth factor receptor 2
Type:Receptor Tyrosine Kinase
Mol. Mass.:151510.97
Organism:Homo sapiens (Human)
Description:P35968
Residue:1356
BDBM50363958
NameBDBM50363958
Synonyms:CHEMBL1952211
TypeSmall organic molecule
Emp. Form.C24H25N5O3
Mol. Mass.431.487
SMILESCOc1ccc(cc1)N1Cc2cnc(Nc3ccccc3)nc2N([C@H]2CC[C@H](O)C2)C1=O